Target
Epidermal growth factor receptor
Ligand
BDBM4445
Substrate
Meas. Tech.
ChEMBL_66597 (CHEMBL680028)
IC50
190±n/a nM
Citation
 Wissner, AOverbeek, EReich, MFFloyd, MBJohnson, BDMamuya, NRosfjord, ECDiscafani, CDavis, RShi, XRabindran, SKGruber, BCYe, FHallett, WANilakantan, RShen, RWang, YFGreenberger, LMTsou, HR Synthesis and structure-activity relationships of 6,7-disubstituted 4-anilinoquinoline-3-carbonitriles. The design of an orally active, irreversible inhibitor of the tyrosine kinase activity of the epidermal growth factor receptor (EGFR) and the human epidermal growth factor receptor-2 (HER-2). J Med Chem 46:49-63 (2002)  
Target
Name:
Epidermal growth factor receptor
Synonyms:
EGF Receptor Substrate EGFR_HUMAN ERBB1 Epidermal Growth Factor Receptor erbB-1 Epidermal growth factor receptor (EGFR) HER1 Proto-oncogene c-ErbB-1 Tyrosine-Protein Kinase ErbB-1
Type:
Receptor Kinase Domain
Mol. Mass.:
134279.59
Organism:
Homo sapiens (Human)
Description:
P00533
Residue:
1210
  
Inhibitor
Name:
BDBM4445
Synonyms:
4-(3-Bromophenylamino)-6,7-dimethoxyquinoline-3-carbonitrile 6,7-dialkoxyquinoline-3-carbonitrile deriv. 8 | CHEMBL111038
Type:
Small organic molecule
Emp. Form.:
C18H14BrN3O2
Mol. Mass.:
384.227
SMILES:
COc1cc2ncc(C#N)c(Nc3cccc(Br)c3)c2cc1OC
: