Target
Transporter
Ligand
BDBM50005576
Substrate
Meas. Tech.
ChEMBL_144992 (CHEMBL755918)
Ki
22±n/a nM
Citation
 Carroll, FI 2002 Medicinal Chemistry Division Award address: monoamine transporters and opioid receptors. Targets for addiction therapy. J Med Chem 46:1775-94 (2003)  
Target
Name:
Transporter
Synonyms:
Monoamine transporters; Norepininephrine & dopamine | Norepinephrine Monoamine transporters
Type:
PROTEIN
Mol. Mass.:
66787.87
Organism:
Rattus norvegicus
Description:
ChEMBL_1463061
Residue:
597
  
Inhibitor
Name:
BDBM50005576
Synonyms:
(3S,8R)-3-(4-Iodo-phenyl)-8-methyl-8-aza-bicyclo[3.2.1]octane-2-carboxylic acid methyl ester CHEMBL300226
Type:
Small organic molecule
Emp. Form.:
C16H20INO2
Mol. Mass.:
385.24
SMILES:
COC(=O)C1C2CC[C@H](C[C@@H]1c1ccc(I)cc1)N2C
: