Target
Carbonic anhydrase 1
Ligand
BDBM50128212
Substrate
Meas. Tech.
ChEMBL_44852 (CHEMBL653166)
Ki
37±n/a nM
Citation
 Winum, JYVullo, DCasini, AMontero, JLScozzafava, ASupuran, CT Carbonic anhydrase inhibitors. Inhibition of cytosolic isozymes I and II and transmembrane, tumor-associated isozyme IX with sulfamates including EMATE also acting as steroid sulfatase inhibitors. J Med Chem 46:2197-204 (2003)  
Target
Name:
Carbonic anhydrase 1
Synonyms:
CA-I CAB Carbonate dehydratase I Carbonic anhydrase 1 (CA I) Carbonic anhydrase 1 (Recombinant CA I) Carbonic anhydrase B Carbonic anhydrase I (CA I) Carbonic anhydrase I (CAI) Carbonic anhydrase isoenzyme I (hCA I) | hCA
Type:
Enzyme
Mol. Mass.:
28873.37
Organism:
Homo sapiens (Human)
Description:
P00915
Residue:
261
  
Inhibitor
Name:
BDBM50128212
Synonyms:
CHEMBL68590 | Sulfamic acid 4-acetylamino-phenyl ester
Type:
Small organic molecule
Emp. Form.:
C8H10N2O4S
Mol. Mass.:
230.241
SMILES:
CC(=O)Nc1ccc(OS(N)(=O)=O)cc1
: