Target
Carbonic anhydrase 2
Ligand
BDBM50098102
Substrate
Meas. Tech.
ChEMBL_45235 (CHEMBL657193)
Ki
1.1±n/a nM
Citation
 Winum, JYVullo, DCasini, AMontero, JLScozzafava, ASupuran, CT Carbonic anhydrase inhibitors. Inhibition of cytosolic isozymes I and II and transmembrane, tumor-associated isozyme IX with sulfamates including EMATE also acting as steroid sulfatase inhibitors. J Med Chem 46:2197-204 (2003)  
Target
Name:
Carbonic anhydrase 2
Synonyms:
CA-II CAC Carbonate dehydratase II Carbonic anhydrase 2 (CA-II) Carbonic anhydrase C Carbonic anhydrase II (CA-II) Carbonic anhydrase II (hCA II) | Carbonic anhydrase isoenzyme II (hCA II)
Type:
Enzyme
Mol. Mass.:
29250.71
Organism:
Homo sapiens (Human)
Description:
P00918
Residue:
260
  
Inhibitor
Name:
BDBM50098102
Synonyms:
CHEMBL23350 | Sulfamic acid 4-chloro-phenyl ester
Type:
Small organic molecule
Emp. Form.:
C6H6ClNO3S
Mol. Mass.:
207.635
SMILES:
NS(=O)(=O)Oc1ccc(Cl)cc1
: