Target
Carbonic anhydrase 9
Ligand
BDBM50112403
Substrate
Meas. Tech.
ChEMBL_45448 (CHEMBL657972)
Ki
23±n/a nM
Citation
 Winum, JYVullo, DCasini, AMontero, JLScozzafava, ASupuran, CT Carbonic anhydrase inhibitors. Inhibition of cytosolic isozymes I and II and transmembrane, tumor-associated isozyme IX with sulfamates including EMATE also acting as steroid sulfatase inhibitors. J Med Chem 46:2197-204 (2003)  
Target
Name:
Carbonic anhydrase 9
Synonyms:
CA-IX CAH9_HUMAN Carbonic anhydrase 9 (CA IX) Carbonic anhydrase 9 precursor Carbonic anhydrase IX (CAIX) Carbonic anhydrases; II & IX MN RCC-associated antigen G250
Type:
Enzyme
Mol. Mass.:
49669.03
Organism:
Homo sapiens (Human)
Description:
Catalytic domain of human cloned isozyme was used in the assay
Residue:
459
  
Inhibitor
Name:
BDBM50112403
Synonyms:
CHEMBL24120 | Sulfamic acid 4-iodo-phenyl ester
Type:
Small organic molecule
Emp. Form.:
C6H6INO3S
Mol. Mass.:
299.086
SMILES:
NS(=O)(=O)Oc1ccc(I)cc1
: