Target
Cytosol aminopeptidase
Ligand
BDBM50129677
Substrate
Meas. Tech.
ChEMBL_98401 (CHEMBL881814)
Ki
330±n/a nM
Citation
 Grembecka, JMucha, ACierpicki, TKafarski, P The most potent organophosphorus inhibitors of leucine aminopeptidase. Structure-based design, chemistry, and activity. J Med Chem 46:2641-55 (2003)  
Target
Name:
Cytosol aminopeptidase
Synonyms:
AMPL_HUMAN LAP3 Leucine aminopeptidase | PEPS
Type:
PROTEIN
Mol. Mass.:
56171.75
Organism:
Homo sapiens (Human)
Description:
ChEMBL_1507539
Residue:
519
  
Inhibitor
Name:
BDBM50129677
Synonyms:
3-[(1-Amino-3-methyl-butyl)-hydroxy-phosphinoyl]-propionic acid | CHEMBL88179
Type:
Small organic molecule
Emp. Form.:
C8H18NO4P
Mol. Mass.:
223.2066
SMILES:
CC(C)CC(=N)P(O)(O)CCC(O)=O
: