Target
Kappa-type opioid receptor
Ligand
BDBM50027052
Substrate
Meas. Tech.
ChEMBL_146507 (CHEMBL754616)
Ki
0.630000±n/a nM
Citation
 Thomas, JBAtkinson, RNVinson, NACatanzaro, JLPerretta, CLFix, SEMascarella, SWRothman, RBXu, HDersch, CMCantrell, BEZimmerman, DMCarroll, FI Identification of (3R)-7-hydroxy-N-((1S)-1-[[(3R,4R)-4-(3-hydroxyphenyl)- 3,4-dimethyl-1-piperidinyl]methyl]-2-methylpropyl)-1,2,3,4-tetrahydro- 3-isoquinolinecarboxamide as a novel potent and selective opioid kappa receptor antagonist. J Med Chem 46:3127-37 (2003)  
Target
Name:
Kappa-type opioid receptor
Synonyms:
Kappa Opioid Receptor OPRK1 Opiate Kappa 1 | mu/kappa opioid receptor
Type:
G Protein-Coupled Receptor (GPCR)
Mol. Mass.:
42744.99
Organism:
Cavia porcellus (domestic guinea pig)
Description:
P41144
Residue:
380
  
Inhibitor
Name:
BDBM50027052
Synonyms:
CHEMBL2112473
Type:
Small organic molecule
Emp. Form.:
C28H41N3O2
Mol. Mass.:
451.644
SMILES:
CC(C)[C@@H](CN1CC[C@](C)([C@@H](C)C1)c1cccc(O)c1)NC[C@H]1Cc2ccc(O)cc2CN1
: