Target
NH(3)-dependent NAD(+) synthetase
Ligand
BDBM50130835
Substrate
Meas. Tech.
ChEMBL_141613 (CHEMBL747929)
IC50
89000±n/a nM
Citation
 Velu, SECristofoli, WAGarcia, GJBrouillette, CGPierson, MCLuan, CHDeLucas, LJBrouillette, WJ Tethered dimers as NAD synthetase inhibitors with antibacterial activity. J Med Chem 46:3371-81 (2003)  
Target
Name:
NH(3)-dependent NAD(+) synthetase
Synonyms:
GSP38 NADE_BACSU Sporulation protein outB outB
Type:
PROTEIN
Mol. Mass.:
30386.77
Organism:
Bacillus subtilis
Description:
ChEMBL_141613
Residue:
272
  
Inhibitor
Name:
BDBM50130835
Synonyms:
CHEMBL115226 | Trimethyl-{4-[4-(5-nitro-indol-1-yl)-butoxycarbonylmethyl]-phenyl}-ammonium; iodide
Type:
Small organic molecule
Emp. Form.:
C23H28N3O4
Mol. Mass.:
410.4856
SMILES:
C[N+](C)(C)c1ccc(CC(=O)OCCCCn2ccc3cc(ccc23)[N+]([O-])=O)cc1
: