Target
Thymidine kinase, cytosolic
Ligand
BDBM50131916
Substrate
Meas. Tech.
ChEMBL_208213 (CHEMBL815478)
Ki
32000±n/a nM
Citation
 Vanheusden, VMunier-Lehmann, HFroeyen, MDugué, LHeyerick, ADe Keukeleire, DPochet, SBusson, RHerdewijn, PVan Calenbergh, S 3'-C-branched-chain-substituted nucleosides and nucleotides as potent inhibitors of Mycobacterium tuberculosis thymidine monophosphate kinase. J Med Chem 46:3811-21 (2003)  
Target
Name:
Thymidine kinase, cytosolic
Synonyms:
KITH_HUMAN | TK1
Type:
PROTEIN
Mol. Mass.:
25476.50
Organism:
Homo sapiens (Human)
Description:
ChEMBL_1333884
Residue:
234
  
Inhibitor
Name:
BDBM50131916
Synonyms:
Phosphoric acid mono-[3-azidomethyl-5-(5-methyl-2,4-dioxo-3,4-dihydro-2H-pyrimidin-1-yl)-tetrahydro-furan-2-ylmethyl] ester
Type:
Small organic molecule
Emp. Form.:
C11H14N5O7P
Mol. Mass.:
359.233
SMILES:
Cc1cn([C@H]2C[C@H](CN=[N+]=[N-])[C@@H](COP([O-])([O-])=O)O2)c(=O)[nH]c1=O
: