Target
5-hydroxytryptamine receptor 1A
Ligand
BDBM50131926
Substrate
Meas. Tech.
ChEMBL_1092 (CHEMBL616415)
Ki
3.12±n/a nM
Citation
 Campiani, GButini, STrotta, FFattorusso, CCatalanotti, BAiello, FGemma, SNacci, VNovellino, EStark, JACagnotto, AFumagalli, ECarnovali, FCervo, LMennini, T Synthesis and pharmacological evaluation of potent and highly selective D3 receptor ligands: inhibition of cocaine-seeking behavior and the role of dopamine D3/D2 receptors. J Med Chem 46:3822-39 (2003)  
Target
Name:
5-hydroxytryptamine receptor 1A
Synonyms:
5-HT-1A 5-HT1A 5-hydroxytryptamine receptor 1A (5HT1A) 5ht1a Htr1a Serotonin 1a (5-HT1a) receptor/Adrenergic receptor alpha-1 | Serotonin receptor 1A
Type:
G Protein-Coupled Receptor (GPCR)
Mol. Mass.:
46445.29
Organism:
Rattus norvegicus (rat)
Description:
Binding assays were performed using rat hippocampal membranes.
Residue:
422
  
Inhibitor
Name:
BDBM50131926
Synonyms:
CHEMBL127400 Isoquinoline-3-carboxylic acid {4-[4-(2-methoxy-phenyl)-piperazin-1-yl]-butyl}-amide
Type:
Small organic molecule
Emp. Form.:
C25H30N4O2
Mol. Mass.:
418.5313
SMILES:
COc1ccccc1N1CCN(CCCCNC(=O)c2cc3ccccc3cn2)CC1
: