Target
Hydroxycarboxylic acid receptor 2
Ligand
BDBM50241312
Substrate
Meas. Tech.
ChEMBL_144336 (CHEMBL751847)
Ki
101000±n/a nM
Citation
 van Herk, TBrussee, Jvan den Nieuwendijk, AMvan der Klein, PAIJzerman, APStannek, CBurmeister, ALorenzen, A Pyrazole derivatives as partial agonists for the nicotinic acid receptor. J Med Chem 46:3945-51 (2003)  
Target
Name:
Hydroxycarboxylic acid receptor 2
Synonyms:
Gpr109 Gpr109b HM74 nicotinic acid GPCR Niacr1 | Pumag
Type:
PROTEIN
Mol. Mass.:
41476.06
Organism:
Rattus norvegicus
Description:
ChEMBL_820675
Residue:
360
  
Inhibitor
Name:
BDBM50241312
Synonyms:
3-phenyl-1H-pyrazole-5-carboxylic acid CHEMBL397785
Type:
Small organic molecule
Emp. Form.:
C10H8N2O2
Mol. Mass.:
188.1827
SMILES:
OC(=O)c1cc(n[nH]1)-c1ccccc1
: