Target
Hydroxycarboxylic acid receptor 2
Ligand
BDBM50132150
Substrate
Meas. Tech.
ChEMBL_144336 (CHEMBL751847)
Ki
20300±n/a nM
Citation
 van Herk, TBrussee, Jvan den Nieuwendijk, AMvan der Klein, PAIJzerman, APStannek, CBurmeister, ALorenzen, A Pyrazole derivatives as partial agonists for the nicotinic acid receptor. J Med Chem 46:3945-51 (2003)  
Target
Name:
Hydroxycarboxylic acid receptor 2
Synonyms:
Gpr109 Gpr109b HM74 nicotinic acid GPCR Niacr1 | Pumag
Type:
PROTEIN
Mol. Mass.:
41476.06
Organism:
Rattus norvegicus
Description:
ChEMBL_820675
Residue:
360
  
Inhibitor
Name:
BDBM50132150
Synonyms:
5-(4-Methyl-benzyl)-1H-pyrazole-3-carboxylic acid | CHEMBL128949
Type:
Small organic molecule
Emp. Form.:
C12H12N2O2
Mol. Mass.:
216.2359
SMILES:
Cc1ccc(Cc2cc(n[nH]2)C(O)=O)cc1
: