Target
Histamine H4 receptor
Ligand
BDBM50133010
Substrate
Meas. Tech.
ChEMBL_87092 (CHEMBL700770)
Ki
202±n/a nM
Citation
 Jablonowski, JAGrice, CAChai, WDvorak, CAVenable, JDKwok, AKLy, KSWei, JBaker, SMDesai, PJJiang, WWilson, SJThurmond, RLKarlsson, LEdwards, JPLovenberg, TWCarruthers, NI The first potent and selective non-imidazole human histamine H4 receptor antagonists. J Med Chem 46:3957-60 (2003)  
Target
Name:
Histamine H4 receptor
Synonyms:
AXOR35 GPCR105 HH4R HRH4 Histamine H4 receptor Histamine receptor (H3 and H4) SP9144
Type:
G Protein-Coupled Receptor (GPCR)
Mol. Mass.:
44517.02
Organism:
Homo sapiens (Human)
Description:
Binding assays were using CHO cells stably expressing hH4R receptors.
Residue:
390
  
Inhibitor
Name:
BDBM50133010
Synonyms:
(1H-Indol-2-yl)-(3-methyl-piperazin-1-yl)-methanone | CHEMBL341087
Type:
Small organic molecule
Emp. Form.:
C14H17N3O
Mol. Mass.:
243.3043
SMILES:
CC1CN(CCN1)C(=O)c1cc2ccccc2[nH]1
: