Target
Neurotensin receptor type 1
Ligand
BDBM50133200
Substrate
Meas. Tech.
ChEMBL_144308 (CHEMBL754353)
IC50
0.34±n/a nM
Citation
 Kokko, KPHadden, MKOrwig, KSMazella, JDix, TA In vitro analysis of stable, receptor-selective neurotensin[8-13] analogues. J Med Chem 46:4141-8 (2003)  
Target
Name:
Neurotensin receptor type 1
Synonyms:
Dopamine receptor D2L/neurotensin receptor NTS1 NTRR Neurotensin receptor 1 | neurotensin receptor type 1
Type:
PROTEIN
Mol. Mass.:
46278.89
Organism:
Homo sapiens (Human)
Description:
ChEMBL_1453811
Residue:
418
  
Inhibitor
Name:
BDBM50133200
Synonyms:
CHEMBL129953 | Compound KK12
Type:
Small organic molecule
Emp. Form.:
C40H69N10O8
Mol. Mass.:
818.0375
SMILES:
CC[C@H](C)[C@H](NC(=O)[C@H](Cc1ccc(O)cc1)NC(=O)[C@@H]1CCCN1C(=O)[C@@H](N)CCCN=C(N)NC(=O)[C@@H](N)CCC[N+](C)(C)C)C(=O)N[C@@H](CC(C)C)C(O)=O
: