Target
Kappa-type opioid receptor
Ligand
BDBM50133226
Substrate
Meas. Tech.
ChEMBL_145707 (CHEMBL753915)
Ki
0.13±n/a nM
Citation
 Schütz, JSpetea, MKoch, MAceto, MDHarris, LSCoop, ASchmidhammer, H Synthesis and biological evaluation of 14-alkoxymorphinans. 20. 14-phenylpropoxymetopon: an extremely powerful analgesic. J Med Chem 46:4182-7 (2003)  
Target
Name:
Kappa-type opioid receptor
Synonyms:
KOR-1 OPIATE Kappa Opioid receptor Ror-d
Type:
G Protein-Coupled Receptor (GPCR)
Mol. Mass.:
42692.90
Organism:
Rattus norvegicus (rat)
Description:
P34975
Residue:
380
  
Inhibitor
Name:
BDBM50133226
Synonyms:
15-methoxy-3-methyl-19-(1-methylbutyl)-13-oxa-3-azahexacyclo[13.2.2.12,8.01,6.06,14.07,12]icosa-7,9,11,16-tetraene | CHEMBL133836
Type:
Small organic molecule
Emp. Form.:
C25H33NO2
Mol. Mass.:
379.535
SMILES:
CCC[C@H](C)C1C[C@]23C=C[C@]1(OC)[C@@H]1Oc4cccc5C[C@H]2N(C)CC[C@@]31c45
: