Target
Mu-type opioid receptor
Ligand
BDBM50133224
Substrate
Meas. Tech.
ChEMBL_148855 (CHEMBL756651)
Ki
0.2±n/a nM
Citation
 Schütz, JSpetea, MKoch, MAceto, MDHarris, LSCoop, ASchmidhammer, H Synthesis and biological evaluation of 14-alkoxymorphinans. 20. 14-phenylpropoxymetopon: an extremely powerful analgesic. J Med Chem 46:4182-7 (2003)  
Target
Name:
Mu-type opioid receptor
Synonyms:
MOR-1 Mu-type opioid receptor (MOR) OPRM_RAT Opioid receptor B Ror-b
Type:
G Protein-Coupled Receptor (GPCR)
Mol. Mass.:
44503.11
Organism:
Rattus norvegicus (rat)
Description:
Competition binding assays were carried out using membrane preparations from transfected HN9.10 cells that constitutively expressed the mu opioid receptor.
Residue:
398
  
Inhibitor
Name:
BDBM50133224
Synonyms:
10-hydroxy-4,13-dimethyl-17-(3-phenylpropoxy)-12-oxa-4-azapentacyclo[9.6.1.01,13.05,17.07,18]octadeca-7(18),8,10,15-tetraen-14-one | CHEMBL335969
Type:
Small organic molecule
Emp. Form.:
C28H33NO4
Mol. Mass.:
447.5659
SMILES:
CCC[C@]12c3c4O[C@@]1(C)C(=O)C=C[C@@]2(OCCCc1ccccc1)C(Cc3ccc4O)NC
: