Target
5-hydroxytryptamine receptor 2A
Ligand
BDBM50003039
Substrate
Meas. Tech.
ChEMBL_2310 (CHEMBL617517)
Ki
4.9±n/a nM
Citation
 May, JAChen, HHRusinko, ALynch, VMSharif, NAMcLaughlin, MA A novel and selective 5-HT2 receptor agonist with ocular hypotensive activity: (S)-(+)-1-(2-aminopropyl)-8,9-dihydropyrano[3,2-e]indole. J Med Chem 46:4188-95 (2003)  
Target
Name:
5-hydroxytryptamine receptor 2A
Synonyms:
5-HT-2 5-HT2A 5-hydroxytryptamine receptor 2A (5HT-2A) 5HT2A_HUMAN HTR2A | Serotonin receptor 2A
Type:
undefined
Mol. Mass.:
52607.65
Organism:
Homo sapiens (Human)
Description:
P28223
Residue:
471
  
Inhibitor
Name:
BDBM50003039
Synonyms:
2-(3,7,8,9-Tetrahydro-pyrano[3,2-e]indol-1-yl)-ethylamine | CHEMBL27173
Type:
Small organic molecule
Emp. Form.:
C13H16N2O
Mol. Mass.:
216.2789
SMILES:
NCCc1c[nH]c2ccc3OCCCc3c12
: