Target
Malate dehydrogenase, cytoplasmic
Ligand
BDBM50134035
Substrate
Meas. Tech.
ChEMBL_104019 (CHEMBL709628)
IC50
125000±n/a nM
Citation
 Seidler, JMcGovern, SLDoman, TNShoichet, BK Identification and prediction of promiscuous aggregating inhibitors among known drugs. J Med Chem 46:4477-86 (2003)  
Target
Name:
Malate dehydrogenase, cytoplasmic
Synonyms:
Cytosolic malate dehydrogenase MDHA Malate dehydrogenase cytoplasmic | Malate dehydrogenase, cytoplasmic
Type:
PROTEIN
Mol. Mass.:
36427.72
Organism:
Homo sapiens (Human)
Description:
ChEMBL_1456624
Residue:
334
  
Inhibitor
Name:
BDBM50134035
Synonyms:
BENZYL BENZOATE | CHEMBL1239
Type:
Small organic molecule
Emp. Form.:
C14H12O2
Mol. Mass.:
212.2439
SMILES:
O=C(OCc1ccccc1)c1ccccc1
: