Target
Malate dehydrogenase, cytoplasmic
Ligand
BDBM31770
Substrate
Meas. Tech.
ChEMBL_104019 (CHEMBL709628)
IC50
20000±n/a nM
Citation
 Seidler, JMcGovern, SLDoman, TNShoichet, BK Identification and prediction of promiscuous aggregating inhibitors among known drugs. J Med Chem 46:4477-86 (2003)  
Target
Name:
Malate dehydrogenase, cytoplasmic
Synonyms:
Cytosolic malate dehydrogenase MDHA Malate dehydrogenase cytoplasmic | Malate dehydrogenase, cytoplasmic
Type:
PROTEIN
Mol. Mass.:
36427.72
Organism:
Homo sapiens (Human)
Description:
ChEMBL_1456624
Residue:
334
  
Inhibitor
Name:
BDBM31770
Synonyms:
Exelderm cid_65495 | sulconazole
Type:
Small organic molecule
Emp. Form.:
C18H15Cl3N2S
Mol. Mass.:
397.749
SMILES:
Clc1ccc(CSC(Cn2ccnc2)c2ccc(Cl)cc2Cl)cc1
: