Target
Malate dehydrogenase, cytoplasmic
Ligand
BDBM31768
Substrate
Meas. Tech.
ChEMBL_104019 (CHEMBL709628)
IC50
>150000±n/a nM
Citation
 Seidler, JMcGovern, SLDoman, TNShoichet, BK Identification and prediction of promiscuous aggregating inhibitors among known drugs. J Med Chem 46:4477-86 (2003)  
Target
Name:
Malate dehydrogenase, cytoplasmic
Synonyms:
Cytosolic malate dehydrogenase MDHA Malate dehydrogenase cytoplasmic | Malate dehydrogenase, cytoplasmic
Type:
PROTEIN
Mol. Mass.:
36427.72
Organism:
Homo sapiens (Human)
Description:
ChEMBL_1456624
Residue:
334
  
Inhibitor
Name:
BDBM31768
Synonyms:
CHEMBL295698 Nizoral | Panfungol
Type:
Small organic molecule
Emp. Form.:
C26H28Cl2N4O4
Mol. Mass.:
531.431
SMILES:
CC(=O)N1CCN(CC1)c1ccc(OC[C@@H]2CO[C@](Cn3ccnc3)(O2)c2ccc(Cl)cc2Cl)cc1
: