Target
C-C chemokine receptor type 5
Ligand
BDBM50123439
Substrate
Meas. Tech.
ChEMBL_39639 (CHEMBL649945)
Ki
12±n/a nM
Citation
 Debnath, AK Generation of predictive pharmacophore models for CCR5 antagonists: study with piperidine- and piperazine-based compounds as a new class of HIV-1 entry inhibitors. J Med Chem 46:4501-15 (2003)  
Target
Name:
C-C chemokine receptor type 5
Synonyms:
C-C CKR-5 CC-CKR-5 CCR5 CCR5_HUMAN CHEMR13 HIV-1 fusion coreceptor
Type:
Enzyme
Mol. Mass.:
40540.21
Organism:
Homo sapiens (Human)
Description:
P51681
Residue:
352
  
Inhibitor
Name:
BDBM50123439
Synonyms:
(4,6-Dimethyl-2-phenyl-pyrimidin-5-yl)-(4-methyl-4-{(S)-3-methyl-4-[(S)-1-(4-trifluoromethyl-phenyl)-ethyl]-piperazin-1-yl}-piperidin-1-yl)-methanone | CHEMBL344607
Type:
Small organic molecule
Emp. Form.:
C33H40F3N5O
Mol. Mass.:
579.6988
SMILES:
C[C@H](N1CCN(C[C@@H]1C)C1(C)CCN(CC1)C(=O)c1c(C)nc(nc1C)-c1ccccc1)c1ccc(cc1)C(F)(F)F
: