Target
Dipeptidyl peptidase 2
Ligand
BDBM50135059
Substrate
Meas. Tech.
ChEMBL_53367 (CHEMBL666613)
IC50
4900±n/a nM
Citation
 Senten, KVan der Veken, PDe Meester, ILambeir, AMScharpé, SHaemers, AAugustyns, K Design, synthesis, and SAR of potent and selective dipeptide-derived inhibitors for dipeptidyl peptidases. J Med Chem 46:5005-14 (2003)  
Target
Name:
Dipeptidyl peptidase 2
Synonyms:
DAP II DPP2_HUMAN Dipeptidyl aminopeptidase II Dipeptidyl peptidase 2 (DPP2) Dipeptidyl peptidase II (DPP II) Dipeptidyl peptidase II and dipeptidyl peptidase IV (DPP2 and DPP4) carboxytripeptidase dipeptidyl(amino)peptidase II | dipeptidylarylamidase
Type:
Protein
Mol. Mass.:
54339.29
Organism:
Homo sapiens (Human)
Description:
Q9UHL4
Residue:
492
  
Inhibitor
Name:
BDBM50135059
Synonyms:
2,6-Diamino-1-(3-azido-pyrrolidin-1-yl)-hexan-1-one | CHEMBL144226
Type:
Small organic molecule
Emp. Form.:
C10H20N6O
Mol. Mass.:
240.3054
SMILES:
NCCCCC(N)C(=O)N1CCC(C1)N=[N+]=[N-]
: