Target
Dipeptidyl peptidase 4
Ligand
BDBM50118951
Substrate
Meas. Tech.
ChEMBL_53364 (CHEMBL664534)
IC50
41000±n/a nM
Citation
 Senten, KVan der Veken, PDe Meester, ILambeir, AMScharpé, SHaemers, AAugustyns, K Design, synthesis, and SAR of potent and selective dipeptide-derived inhibitors for dipeptidyl peptidases. J Med Chem 46:5005-14 (2003)  
Target
Name:
Dipeptidyl peptidase 4
Synonyms:
ADABP Adenosine deaminase complexing protein 2 CD_antigen=CD26 DPP4 DPPIV Dipeptidyl peptidase 4 (DPP IV) Dipeptidyl peptidase 4 (DPP4) Dipeptidyl peptidase 4 membrane form Dipeptidyl peptidase IV Dipeptidyl peptidase IV (DDP-IV) Dipeptidyl peptidase IV membrane form Dipeptidyl peptidase-IV (DPP-4) T-cell activation antigen CD26 | TP103
Type:
Enzyme
Mol. Mass.:
88271.01
Organism:
Homo sapiens (Human)
Description:
P27487
Residue:
766
  
Inhibitor
Name:
BDBM50118951
Synonyms:
2-Amino-1-pyrrolidin-1-yl-propan-1-one | CHEMBL16723
Type:
Small organic molecule
Emp. Form.:
C7H14N2O
Mol. Mass.:
142.1989
SMILES:
CC(N)C(=O)N1CCCC1
: