Target
Adenosine receptor A2a
Ligand
BDBM50125913
Substrate
Meas. Tech.
ChEMBL_31493 (CHEMBL649802)
Ki
>1000±n/a nM
Citation
 Baraldi, PGFruttarolo, FTabrizi, MAPreti, DRomagnoli, REl-Kashef, HMoorman, AVarani, KGessi, SMerighi, SBorea, PA Design, synthesis, and biological evaluation of C9- and C2-substituted pyrazolo[4,3-e]-1,2,4-triazolo[1,5-c]pyrimidines as new A2A and A3 adenosine receptors antagonists. J Med Chem 46:1229-41 (2003)  
Target
Name:
Adenosine receptor A2a
Synonyms:
A2A adenosine receptor (hA2A) ADENOSINE A2 ADORA2 Adenosine A2A receptor (A2AAR)
Type:
G Protein-Coupled Receptor (GPCR)
Mol. Mass.:
44716.46
Organism:
Homo sapiens (Human)
Description:
P29274
Residue:
412
  
Inhibitor
Name:
BDBM50125913
Synonyms:
7-Phenethyl-2-phenyl-7H-pyrazolo[4,3-e][1,2,4]triazolo[1,5-c]pyrimidin-5-ylamine | CHEMBL280411
Type:
Small organic molecule
Emp. Form.:
C20H17N7
Mol. Mass.:
355.3959
SMILES:
Nc1nc2n(CCc3ccccc3)ncc2c2nc(nn12)-c1ccccc1
: