Target
Adenosine receptor A1
Ligand
BDBM50125916
Substrate
Meas. Tech.
ChEMBL_27593 (CHEMBL644313)
Ki
260±n/a nM
Citation
 Baraldi, PGFruttarolo, FTabrizi, MAPreti, DRomagnoli, REl-Kashef, HMoorman, AVarani, KGessi, SMerighi, SBorea, PA Design, synthesis, and biological evaluation of C9- and C2-substituted pyrazolo[4,3-e]-1,2,4-triazolo[1,5-c]pyrimidines as new A2A and A3 adenosine receptors antagonists. J Med Chem 46:1229-41 (2003)  
Target
Name:
Adenosine receptor A1
Synonyms:
A1 adenosine receptor (hA1) AA1R_HUMAN ADORA1 Adenosine A1-receptor Adenosine receptor A1 (hA1) | Adenosine transporter (AdT)
Type:
G Protein-Coupled Receptor (GPCR)
Mol. Mass.:
36520.92
Organism:
Homo sapiens (Human)
Description:
P30542
Residue:
326
  
Inhibitor
Name:
BDBM50125916
Synonyms:
2-Furan-2-yl-N*9*-(4-methoxy-phenyl)-8-methyl-8H-pyrazolo[4,3-e][1,2,4]triazolo[1,5-c]pyrimidine-5,9-diamine | CHEMBL20681
Type:
Small organic molecule
Emp. Form.:
C18H16N8O2
Mol. Mass.:
376.372
SMILES:
COc1ccc(Nc2n(C)nc3nc(N)n4nc(nc4c23)-c2ccco2)cc1
: