Target
Adenosine receptor A3
Ligand
BDBM50125910
Substrate
Meas. Tech.
ChEMBL_31411 (CHEMBL644554)
IC50
813±n/a nM
Citation
 Baraldi, PGFruttarolo, FTabrizi, MAPreti, DRomagnoli, REl-Kashef, HMoorman, AVarani, KGessi, SMerighi, SBorea, PA Design, synthesis, and biological evaluation of C9- and C2-substituted pyrazolo[4,3-e]-1,2,4-triazolo[1,5-c]pyrimidines as new A2A and A3 adenosine receptors antagonists. J Med Chem 46:1229-41 (2003)  
Target
Name:
Adenosine receptor A3
Synonyms:
A3 adenosine receptor (hA3) ADORA3 | Adenosine A3 receptor (A3AR)
Type:
G Protein-Coupled Receptor (GPCR)
Mol. Mass.:
36197.32
Organism:
Homo sapiens (Human)
Description:
P0DMS8
Residue:
318
  
Inhibitor
Name:
BDBM50125910
Synonyms:
1-(2-Furan-2-yl-8-methyl-9-methylsulfanyl-8H-pyrazolo[4,3-e][1,2,4]triazolo[1,5-c]pyrimidin-5-yl)-3-(4-methoxy-phenyl)-urea | CHEMBL22113
Type:
Small organic molecule
Emp. Form.:
C20H18N8O3S
Mol. Mass.:
450.474
SMILES:
COc1ccc(NC(=O)Nc2nc3nn(C)c(SC)c3c3nc(nn23)-c2ccco2)cc1
: