Target
Mu-type opioid receptor
Ligand
BDBM50127165
Substrate
Meas. Tech.
ChEMBL_149016 (CHEMBL758580)
Ki
0.023±n/a nM
Citation
 Greiner, ESpetea, MKrassnig, RSchüllner, FAceto, MHarris, LSTraynor, JRWoods, JHCoop, ASchmidhammer, H Synthesis and biological evaluation of 14-alkoxymorphinans. 18. N-substituted 14-phenylpropyloxymorphinan-6-ones with unanticipated agonist properties: extending the scope of common structure-activity relationships. J Med Chem 46:1758-63 (2003)  
Target
Name:
Mu-type opioid receptor
Synonyms:
MOR-1 Mu-type opioid receptor (MOR) OPRM_RAT Opioid receptor B Ror-b
Type:
G Protein-Coupled Receptor (GPCR)
Mol. Mass.:
44503.11
Organism:
Rattus norvegicus (rat)
Description:
Competition binding assays were carried out using membrane preparations from transfected HN9.10 cells that constitutively expressed the mu opioid receptor.
Residue:
398
  
Inhibitor
Name:
BDBM50127165
Synonyms:
10-hydroxy-17-methoxy-4,13-dimethyl-(13R,17S)-12-oxa-4-azapentacyclo[9.6.1.01,13.05,17.07,18]octadeca-7(18),8,10-trien-14-one | 10-hydroxy-17-methoxy-4,13-dimethyl-(13R,17S)-12-oxa-4-azapentacyclo[9.6.1.01,13.05,17.07,18]octadeca-7,9,11(18)-trien-14-one
Type:
Small organic molecule
Emp. Form.:
C19H23NO4
Mol. Mass.:
329.3902
SMILES:
CO[C@]12CCC(=O)[C@]3(C)Oc4c5c(CC1N(C)CC[C@@]235)ccc4O
: