Target
Kappa-type opioid receptor
Ligand
BDBM50127167
Substrate
Meas. Tech.
ChEMBL_145267 (CHEMBL872675)
Ki
0.08±n/a nM
Citation
 Greiner, ESpetea, MKrassnig, RSchüllner, FAceto, MHarris, LSTraynor, JRWoods, JHCoop, ASchmidhammer, H Synthesis and biological evaluation of 14-alkoxymorphinans. 18. N-substituted 14-phenylpropyloxymorphinan-6-ones with unanticipated agonist properties: extending the scope of common structure-activity relationships. J Med Chem 46:1758-63 (2003)  
Target
Name:
Kappa-type opioid receptor
Synonyms:
K-OR-1 Kappa-opioid receptor (KOR) Kappa-type opioid receptor (KOR) OPIATE Kappa OPRK1 kappa opioid receptor (KOR)
Type:
G Protein-Coupled Receptor (GPCR)
Mol. Mass.:
42648.76
Organism:
Homo sapiens (Human)
Description:
P41145
Residue:
380
  
Inhibitor
Name:
BDBM50127167
Synonyms:
10-hydroxy-17-(3-phenylpropoxy)-4-tetrahydro-2-furanylmethyl-(13R,17S)-12-oxa-4-azapentacyclo[9.6.1.01,13.05,17.07,18]octadeca-7,9,11(18)-trien-14-one
Type:
Small organic molecule
Emp. Form.:
C30H35NO5
Mol. Mass.:
489.6026
SMILES:
Oc1ccc2CC3N(CC4CCCO4)CC[C@@]45[C@@H](Oc1c24)C(=O)CC[C@@]35OCCCc1ccccc1
: