Target
Tyrosine-protein kinase Lck
Ligand
BDBM50120106
Substrate
Meas. Tech.
ChEMBL_221311 (CHEMBL841201)
IC50
6±n/a nM
Citation
 Tominaga, YJorgensen, WL General model for estimation of the inhibition of protein kinases using Monte Carlo simulations. J Med Chem 47:2534-49 (2004)  
Target
Name:
Tyrosine-protein kinase Lck
Synonyms:
2.7.10.2 LCK_HUMAN Leukocyte C-terminal Src kinase Lymphocyte-specific protein tyrosine kinase Protein YT16 Proto-oncogene tyrosine-protein kinase LCK T cell-specific protein-tyrosine kinase
Type:
Mol. Mass.:
57987.83
Organism:
Homo sapiens (Human)
Description:
P06239
Residue:
509
  
Inhibitor
Name:
BDBM50120106
Synonyms:
(2-Chloro-6-methyl-phenyl)-(7-morpholin-4-yl-imidazo[1,5-a]quinoxalin-4-yl)-amine N-(2-chloro-6-methylphenyl)-7-morpholinoimidazo[1,5-a]quinoxalin-4-amine
Type:
Small organic molecule
Emp. Form.:
C21H20ClN5O
Mol. Mass.:
393.869
SMILES:
Cc1cccc(Cl)c1Nc1nc2cc(ccc2n2cncc12)N1CCOCC1
: