Target
Cyclin-dependent kinase 2
Ligand
BDBM7708
Substrate
Meas. Tech.
ChEMBL_50506 (CHEMBL661123)
IC50
10±n/a nM
Citation
 Tominaga, YJorgensen, WL General model for estimation of the inhibition of protein kinases using Monte Carlo simulations. J Med Chem 47:2534-49 (2004)  
Target
Name:
Cyclin-dependent kinase 2
Synonyms:
CDK2 CDK2_HUMAN Cell division protein kinase 2 Protein cereblon/Cyclin-dependent kinase 2 | p33 protein kinase
Type:
Enzyme Subunit
Mol. Mass.:
33938.17
Organism:
Homo sapiens (Human)
Description:
P24941
Residue:
298
  
Inhibitor
Name:
BDBM7708
Synonyms:
4-[N -(5-Hydroxy-2-oxo-1,2-dihydro-indol-3-ylidene)hydrazino]benzenesulfonamide Oxindole-Based Inhibitor 44
Type:
Small organic molecule
Emp. Form.:
C14H12N4O4S
Mol. Mass.:
332.334
SMILES:
NS(=O)(=O)c1ccc(NN=C2C(=O)Nc3ccc(O)cc23)cc1
: