Target
Cyclin-dependent kinase 2
Ligand
BDBM7720
Substrate
Meas. Tech.
ChEMBL_50506 (CHEMBL661123)
IC50
4.5±n/a nM
Citation
 Tominaga, YJorgensen, WL General model for estimation of the inhibition of protein kinases using Monte Carlo simulations. J Med Chem 47:2534-49 (2004)  
Target
Name:
Cyclin-dependent kinase 2
Synonyms:
CDK2 CDK2_HUMAN Cell division protein kinase 2 Protein cereblon/Cyclin-dependent kinase 2 | p33 protein kinase
Type:
Enzyme Subunit
Mol. Mass.:
33938.17
Organism:
Homo sapiens (Human)
Description:
P24941
Residue:
298
  
Inhibitor
Name:
BDBM7720
Synonyms:
(3Z)-2-oxo-3-[2-(4-sulfamoylphenyl)hydrazin-1-ylidene]-2,3-dihydro-1H-indole-5-carboxamide Oxindole-Based Inhibitor 56
Type:
Small organic molecule
Emp. Form.:
C15H13N5O4S
Mol. Mass.:
359.36
SMILES:
NC(=O)c1ccc2NC(=O)C(=NNc3ccc(cc3)S(N)(=O)=O)c2c1
: