Target
Cyclin-dependent kinase 2
Ligand
BDBM7686
Substrate
Meas. Tech.
ChEMBL_50506 (CHEMBL661123)
IC50
2.3±n/a nM
Citation
 Tominaga, YJorgensen, WL General model for estimation of the inhibition of protein kinases using Monte Carlo simulations. J Med Chem 47:2534-49 (2004)  
Target
Name:
Cyclin-dependent kinase 2
Synonyms:
CDK2 CDK2_HUMAN Cell division protein kinase 2 Protein cereblon/Cyclin-dependent kinase 2 | p33 protein kinase
Type:
Enzyme Subunit
Mol. Mass.:
33938.17
Organism:
Homo sapiens (Human)
Description:
P24941
Residue:
298
  
Inhibitor
Name:
BDBM7686
Synonyms:
4-[1-(5-Oxazol-5-yl-2-oxo-1,2-dihydro-indol-3-ylidene)-hydrazino]benzenesulfonamide Oxindole-Based Inhibitor 22
Type:
Small organic molecule
Emp. Form.:
C17H13N5O4S
Mol. Mass.:
383.381
SMILES:
NS(=O)(=O)c1ccc(NN=C2C(=O)Nc3ccc(cc23)-c2cnco2)cc1
: