Target
Tyrosine-protein kinase Lck
Ligand
BDBM50120103
Substrate
Meas. Tech.
ChEMBL_221311 (CHEMBL841201)
IC50
11±n/a nM
Citation
 Tominaga, YJorgensen, WL General model for estimation of the inhibition of protein kinases using Monte Carlo simulations. J Med Chem 47:2534-49 (2004)  
Target
Name:
Tyrosine-protein kinase Lck
Synonyms:
2.7.10.2 LCK_HUMAN Leukocyte C-terminal Src kinase Lymphocyte-specific protein tyrosine kinase Protein YT16 Proto-oncogene tyrosine-protein kinase LCK T cell-specific protein-tyrosine kinase
Type:
Mol. Mass.:
57987.83
Organism:
Homo sapiens (Human)
Description:
P06239
Residue:
509
  
Inhibitor
Name:
BDBM50120103
Synonyms:
CHEMBL313466 N-[4-(2-Chloro-6-methyl-phenylamino)-imidazo[1,5-a]quinoxalin-7-yl]-acetamide
Type:
Small organic molecule
Emp. Form.:
C19H16ClN5O
Mol. Mass.:
365.816
SMILES:
CC(=O)Nc1ccc2c(c1)nc(Nc1c(C)cccc1Cl)c1cncn21
: