Target
Tyrosine-protein kinase Lck
Ligand
BDBM50112911
Substrate
Meas. Tech.
ChEMBL_221311 (CHEMBL841201)
IC50
2±n/a nM
Citation
 Tominaga, YJorgensen, WL General model for estimation of the inhibition of protein kinases using Monte Carlo simulations. J Med Chem 47:2534-49 (2004)  
Target
Name:
Tyrosine-protein kinase Lck
Synonyms:
2.7.10.2 LCK_HUMAN Leukocyte C-terminal Src kinase Lymphocyte-specific protein tyrosine kinase Protein YT16 Proto-oncogene tyrosine-protein kinase LCK T cell-specific protein-tyrosine kinase
Type:
Mol. Mass.:
57987.83
Organism:
Homo sapiens (Human)
Description:
P06239
Residue:
509
  
Inhibitor
Name:
BDBM50112911
Synonyms:
(2-Chloro-6-methyl-phenyl)-(6,7-dimethoxy-imidazo[1,5-a]quinoxalin-4-yl)-amine N-(2-chloro-6-methylphenyl)-6,7-dimethoxyimidazo[1,5-a]quinoxalin-4-amine
Type:
Small organic molecule
Emp. Form.:
C19H17ClN4O2
Mol. Mass.:
368.817
SMILES:
COc1ccc2c(nc(Nc3c(C)cccc3Cl)c3cncn23)c1OC
: