Target
Cyclin-dependent kinase 2
Ligand
BDBM7758
Substrate
Meas. Tech.
ChEMBL_50507 (CHEMBL661124)
IC50
5.6±n/a nM
Citation
 Tominaga, YJorgensen, WL General model for estimation of the inhibition of protein kinases using Monte Carlo simulations. J Med Chem 47:2534-49 (2004)  
Target
Name:
Cyclin-dependent kinase 2
Synonyms:
CDK2 CDK2_HUMAN Cell division protein kinase 2 Protein cereblon/Cyclin-dependent kinase 2 | p33 protein kinase
Type:
Enzyme Subunit
Mol. Mass.:
33938.17
Organism:
Homo sapiens (Human)
Description:
P24941
Residue:
298
  
Inhibitor
Name:
BDBM7758
Synonyms:
N-Benzyl-4-{[(7-oxo-6,7-dihydro-8H-[1,3]thiazolo[5,4-e]-indol-8-ylidene)methyl]amino}benzenesulfonamide Oxindole-Based Inhibitor 94
Type:
Small organic molecule
Emp. Form.:
C23H18N4O3S2
Mol. Mass.:
462.544
SMILES:
O=C1Nc2ccc3ncsc3c2C1C=Nc1ccc(cc1)S(=O)(=O)NCc1ccccc1
: