Target
Cyclin-dependent kinase 2
Ligand
BDBM7748
Substrate
Meas. Tech.
ChEMBL_50507 (CHEMBL661124)
IC50
4.6±n/a nM
Citation
 Tominaga, YJorgensen, WL General model for estimation of the inhibition of protein kinases using Monte Carlo simulations. J Med Chem 47:2534-49 (2004)  
Target
Name:
Cyclin-dependent kinase 2
Synonyms:
CDK2 CDK2_HUMAN Cell division protein kinase 2 Protein cereblon/Cyclin-dependent kinase 2 | p33 protein kinase
Type:
Enzyme Subunit
Mol. Mass.:
33938.17
Organism:
Homo sapiens (Human)
Description:
P24941
Residue:
298
  
Inhibitor
Name:
BDBM7748
Synonyms:
N,N-Dimethyl-4-{[(7-oxo-6,7-dihydro-8H-[1,3]thiazolo-[5,4-e]indol-8-ylidene)methyl]amino}benzenesulfonamide Oxindole-Based Inhibitor 84
Type:
Small organic molecule
Emp. Form.:
C18H16N4O3S2
Mol. Mass.:
400.475
SMILES:
CN(C)S(=O)(=O)c1ccc(cc1)N=CC1C(=O)Nc2ccc3ncsc3c12
: