Target
Cyclin-dependent kinase 2
Ligand
BDBM50145922
Substrate
Meas. Tech.
ChEMBL_50506 (CHEMBL661123)
IC50
4.6±n/a nM
Citation
 Tominaga, YJorgensen, WL General model for estimation of the inhibition of protein kinases using Monte Carlo simulations. J Med Chem 47:2534-49 (2004)  
Target
Name:
Cyclin-dependent kinase 2
Synonyms:
CDK2 CDK2_HUMAN Cell division protein kinase 2 Protein cereblon/Cyclin-dependent kinase 2 | p33 protein kinase
Type:
Enzyme Subunit
Mol. Mass.:
33938.17
Organism:
Homo sapiens (Human)
Description:
P24941
Residue:
298
  
Inhibitor
Name:
BDBM50145922
Synonyms:
4-[N'-(4-Iodo-2-oxo-1,2-dihydro-indol-3-ylidene)-hydrazino]-benzenesulfonamide CHEMBL314397
Type:
Small organic molecule
Emp. Form.:
C14H11IN4O3S
Mol. Mass.:
442.232
SMILES:
NS(=O)(=O)c1ccc(cc1)N=Nc1c(O)[nH]c2cccc(I)c12
: