Target
Tyrosine-protein kinase Lck
Ligand
BDBM50112920
Substrate
Meas. Tech.
ChEMBL_221311 (CHEMBL841201)
IC50
9±n/a nM
Citation
 Tominaga, YJorgensen, WL General model for estimation of the inhibition of protein kinases using Monte Carlo simulations. J Med Chem 47:2534-49 (2004)  
Target
Name:
Tyrosine-protein kinase Lck
Synonyms:
2.7.10.2 LCK_HUMAN Leukocyte C-terminal Src kinase Lymphocyte-specific protein tyrosine kinase Protein YT16 Proto-oncogene tyrosine-protein kinase LCK T cell-specific protein-tyrosine kinase
Type:
Mol. Mass.:
57987.83
Organism:
Homo sapiens (Human)
Description:
P06239
Residue:
509
  
Inhibitor
Name:
BDBM50112920
Synonyms:
(2-Chloro-6-methyl-phenyl)-imidazo[1,5-a]quinoxalin-4-yl-amine N-(2-chloro-6-methylphenyl)imidazo[1,5-a]quinoxalin-4-amine
Type:
Small organic molecule
Emp. Form.:
C17H13ClN4
Mol. Mass.:
308.765
SMILES:
Cc1cccc(Cl)c1Nc1nc2ccccc2n2cncc12
: