Target
Cyclin-dependent kinase 2
Ligand
BDBM7692
Substrate
Meas. Tech.
ChEMBL_50506 (CHEMBL661123)
IC50
1.2±n/a nM
Citation
 Tominaga, YJorgensen, WL General model for estimation of the inhibition of protein kinases using Monte Carlo simulations. J Med Chem 47:2534-49 (2004)  
Target
Name:
Cyclin-dependent kinase 2
Synonyms:
CDK2 CDK2_HUMAN Cell division protein kinase 2 Protein cereblon/Cyclin-dependent kinase 2 | p33 protein kinase
Type:
Enzyme Subunit
Mol. Mass.:
33938.17
Organism:
Homo sapiens (Human)
Description:
P24941
Residue:
298
  
Inhibitor
Name:
BDBM7692
Synonyms:
4-[N -(4-Isobutyl-2-oxo-1,2-dihydro-indol-3-ylidene)hydrazino]benzenesulfonamide Oxindole-Based Inhibitor 28
Type:
Small organic molecule
Emp. Form.:
C18H20N4O3S
Mol. Mass.:
372.441
SMILES:
CC(C)Cc1cccc2NC(=O)C(=NNc3ccc(cc3)S(N)(=O)=O)c12
: