Target
Tyrosine-protein kinase Lck
Ligand
BDBM50145937
Substrate
Meas. Tech.
ChEMBL_221311 (CHEMBL841201)
IC50
10±n/a nM
Citation
 Tominaga, YJorgensen, WL General model for estimation of the inhibition of protein kinases using Monte Carlo simulations. J Med Chem 47:2534-49 (2004)  
Target
Name:
Tyrosine-protein kinase Lck
Synonyms:
2.7.10.2 LCK_HUMAN Leukocyte C-terminal Src kinase Lymphocyte-specific protein tyrosine kinase Protein YT16 Proto-oncogene tyrosine-protein kinase LCK T cell-specific protein-tyrosine kinase
Type:
Mol. Mass.:
57987.83
Organism:
Homo sapiens (Human)
Description:
P06239
Residue:
509
  
Inhibitor
Name:
BDBM50145937
Synonyms:
CHEMBL85976 | N*4*-(2-Chloro-6-methyl-phenyl)-N*6*-ethyl-imidazo[1,5-a]quinoxaline-4,6-diamine
Type:
Small organic molecule
Emp. Form.:
C19H18ClN5
Mol. Mass.:
351.833
SMILES:
CCNc1cccc2c1nc(Nc1c(C)cccc1Cl)c1cncn21
: