Target
Tyrosine-protein kinase Lck
Ligand
BDBM50145935
Substrate
Meas. Tech.
ChEMBL_221311 (CHEMBL841201)
IC50
9.4±n/a nM
Citation
 Tominaga, YJorgensen, WL General model for estimation of the inhibition of protein kinases using Monte Carlo simulations. J Med Chem 47:2534-49 (2004)  
Target
Name:
Tyrosine-protein kinase Lck
Synonyms:
2.7.10.2 LCK_HUMAN Leukocyte C-terminal Src kinase Lymphocyte-specific protein tyrosine kinase Protein YT16 Proto-oncogene tyrosine-protein kinase LCK T cell-specific protein-tyrosine kinase
Type:
Mol. Mass.:
57987.83
Organism:
Homo sapiens (Human)
Description:
P06239
Residue:
509
  
Inhibitor
Name:
BDBM50145935
Synonyms:
4-(2-Chloro-6-methyl-phenylamino)-5-methoxy-imidazo[1,5-a]quinoxalin-5-ium | CHEMBL313798
Type:
Small organic molecule
Emp. Form.:
C18H16ClN4O
Mol. Mass.:
339.798
SMILES:
CO[n+]1c(Nc2c(C)cccc2Cl)c2cncn2c2ccccc12
: