Target
B2 bradykinin receptor
Ligand
BDBM50146108
Substrate
Meas. Tech.
ChEMBL_40273 (CHEMBL656508)
IC50
0.09±n/a nM
Citation
 Sawada, YKayakiri, HAbe, YMizutani, TInamura, NAsano, MAramori, IHatori, COku, TTanaka, H A new class of nonpeptide bradykinin B(2) receptor ligand, incorporating a 4-aminoquinoline framework. Identification of a key pharmacophore to determine species difference and agonist/antagonist profile. J Med Chem 47:2667-77 (2004)  
Target
Name:
B2 bradykinin receptor
Synonyms:
B2 BRADYKININ B2R BK-2 receptor BKRB2_HUMAN | Bradykinin B2 receptor
Type:
Enzyme Catalytic Domain
Mol. Mass.:
44467.17
Organism:
Homo sapiens (Human)
Description:
B2 BRADYKININ BDKRB2 HUMAN::P30411
Residue:
391
  
Inhibitor
Name:
BDBM50146108
Synonyms:
Arg-Arg-Pro-Hyp-Gly-Thi-Cys-Tic-Oic-Arg | CHEMBL274610
Type:
Small organic molecule
Emp. Form.:
C59H83N19O12S2
Mol. Mass.:
1314.54
SMILES:
N[C@@H](CCCNC(N)=N)C(=O)N[C@@H](CCCNC(N)=N)C(=O)N1CCC[C@H]1C(=O)N1CC(O)C[C@H]1C(=O)NCC(=O)N[C@@H](Cc1cccs1)C(=O)N[C@@H](CS)C(=O)N1Cc2ccccc2C[C@@H]1C(=O)N1[C@H](Cc2ccccc12)C(=O)N[C@@H](CCCNC(N)=N)C(O)=O
: