Target
Transporter
Ligand
BDBM50148736
Substrate
Meas. Tech.
ChEMBL_143110 (CHEMBL749359)
Ki
652±n/a nM
Citation
 Kulkarni, SSGrundt, PKopajtic, TKatz, JLNewman, AH Structure-activity relationships at monoamine transporters for a series of N-substituted 3alpha-(bis[4-fluorophenyl]methoxy)tropanes: comparative molecular field analysis, synthesis, and pharmacological evaluation. J Med Chem 47:3388-98 (2004)  
Target
Name:
Transporter
Synonyms:
Monoamine transporters; Norepininephrine & dopamine | Norepinephrine Monoamine transporters
Type:
PROTEIN
Mol. Mass.:
66787.87
Organism:
Rattus norvegicus
Description:
ChEMBL_1463061
Residue:
597
  
Inhibitor
Name:
BDBM50148736
Synonyms:
CHEMBL112528 | N-(2-{3-[Bis-(4-fluoro-phenyl)-methoxy]-8-aza-bicyclo[3.2.1]oct-8-yl}-ethyl)-nicotinamide
Type:
Small organic molecule
Emp. Form.:
C28H29F2N3O2
Mol. Mass.:
477.5456
SMILES:
Fc1ccc(cc1)C(OC1CC2CCC(C1)N2CCNC(=O)c1cccnc1)c1ccc(F)cc1
: