Target
Urokinase-type plasminogen activator
Ligand
BDBM50147086
Substrate
Meas. Tech.
ChEMBL_213306 (CHEMBL814360)
Ki
30±n/a nM
Citation
 Erlanson, DAMcDowell, RSO'Brien, T Fragment-based drug discovery. J Med Chem 47:3463-82 (2004)  
Target
Name:
Urokinase-type plasminogen activator
Synonyms:
3.4.21.73 U-plasminogen activator Urokinase Urokinase-type plasminogen activator chain B Urokinase-type plasminogen activator short chain A uPA
Type:
Enzyme
Mol. Mass.:
48528.62
Organism:
Homo sapiens (Human)
Description:
P00749
Residue:
431
  
Inhibitor
Name:
BDBM50147086
Synonyms:
8-(PYRIMIDIN-2-YLAMINO)NAPHTHALENE-2-CARBOXIMIDAMIDE | CHEMBL103043
Type:
Small organic molecule
Emp. Form.:
C15H13N5
Mol. Mass.:
263.2972
SMILES:
NC(=N)c1ccc2cccc(Nc3ncccn3)c2c1
: