Target
Tyrosine-protein phosphatase non-receptor type 1
Ligand
BDBM50131555
Substrate
Meas. Tech.
ChEMBL_162588 (CHEMBL768529)
Ki
42±n/a nM
Citation
 Erlanson, DAMcDowell, RSO'Brien, T Fragment-based drug discovery. J Med Chem 47:3463-82 (2004)  
Target
Name:
Tyrosine-protein phosphatase non-receptor type 1
Synonyms:
PTN1_HUMAN PTPN1 Protein tyrosine phosphatase-1B (PTP1B) Protein-tyrosine phosphatase 1B (PTP1B) Tyrosine-protein phosphatase non-receptor type 1 (PTP1B)
Type:
Protein phosphatase
Mol. Mass.:
49963.76
Organism:
Homo sapiens (Human)
Description:
Human recombinant GST-fusion PTP1B (1-435).
Residue:
435
  
Inhibitor
Name:
BDBM50131555
Synonyms:
2-(4-(2-acetamido-3-(4-(1-carboxy-N-(2-carboxyphenyl)formamido)-3-ethylphenyl)propanamido)butoxy)-6-hydroxybenzoic acid CHEMBL117699
Type:
Small organic molecule
Emp. Form.:
C33H35N3O11
Mol. Mass.:
649.6445
SMILES:
CCc1cc(CC(NC(C)=O)C(=O)NCCCCOc2cccc(O)c2C(O)=O)ccc1N(C(=O)C(O)=O)c1ccccc1C(O)=O
: