Target
Collagenase 3
Ligand
BDBM50149234
Substrate
Meas. Tech.
ChEMBL_106644 (CHEMBL717028)
IC50
10000±n/a nM
Citation
 Erlanson, DAMcDowell, RSO'Brien, T Fragment-based drug discovery. J Med Chem 47:3463-82 (2004)  
Target
Name:
Collagenase 3
Synonyms:
MMP-13 MMP13_HUMAN Matrix metalloproteinase-13 (MMP-13) | Matrix metalloproteinase-13 (MMP13)
Type:
Enzyme
Mol. Mass.:
53808.06
Organism:
Homo sapiens (Human)
Description:
P45452
Residue:
471
  
Inhibitor
Name:
BDBM50149234
Synonyms:
Benzofuran-2-carboxylic acid (4-morpholin-4-yl-butyl)-amide N-(4-morpholinobutyl)benzofuran-2-carboxamide
Type:
Small organic molecule
Emp. Form.:
C17H22N2O3
Mol. Mass.:
302.3682
SMILES:
O=C(NCCCCN1CCOCC1)c1cc2ccccc2o1
: