Target
Delta-type opioid receptor
Ligand
BDBM50140906
Substrate
Meas. Tech.
ChEMBL_145897 (CHEMBL750386)
IC50
243±n/a nM
Citation
 Ananthan, SKhare, NKSaini, SKSeitz, LEBartlett, JLDavis, PDersch, CMPorreca, FRothman, RBBilsky, EJ Identification of opioid ligands possessing mixed micro agonist/delta antagonist activity among pyridomorphinans derived from naloxone, oxymorphone, and hydromorphone [correction of hydropmorphone]. J Med Chem 47:1400-12 (2004)  
Target
Name:
Delta-type opioid receptor
Synonyms:
DOR-1 MSL-2 OPRD_MOUSE Oprd1
Type:
Enzyme Catalytic Domain
Mol. Mass.:
40577.25
Organism:
MOUSE
Description:
P32300
Residue:
372
  
Inhibitor
Name:
BDBM50140906
Synonyms:
1-[2-[1-[2-amino-3-(4-hydroxyphenyl)-(2S)-propanoyl]-(5S)-dihydro-1H-5-pyrrolyl(methyl)carboxamido]-3-phenyl-(2S)-propanoyl]-(5R)-dihydro-1H-5-pyrrolecarboxamide | CHEMBL283287
Type:
Small organic molecule
Emp. Form.:
C29H37N5O5
Mol. Mass.:
535.6346
SMILES:
CN([C@@H](Cc1ccccc1)C(=O)N1CCC[C@@H]1C(N)=O)C(=O)[C@@H]1CCCN1C(=O)[C@@H](N)Cc1ccc(O)cc1
: