Target
Melanocyte-stimulating hormone receptor
Ligand
BDBM50141035
Substrate
Meas. Tech.
ChEMBL_105856 (CHEMBL717326)
EC50
3±n/a nM
Citation
 Han, GHaskell-Luevano, CKendall, LBonner, GHadley, MECone, RDHruby, VJ De novo design, synthesis, and pharmacology of alpha-melanocyte stimulating hormone analogues derived from somatostatin by a hybrid approach. J Med Chem 47:1514-26 (2004)  
Target
Name:
Melanocyte-stimulating hormone receptor
Synonyms:
MC1-R Mc1r Melanocyte-stimulating hormone receptor | Msh-r
Type:
PROTEIN
Mol. Mass.:
35238.60
Organism:
Mus musculus
Description:
ChEMBL_1498846
Residue:
315
  
Inhibitor
Name:
BDBM50141035
Synonyms:
1N-(1-carbamoyl-2-hydroxypropyl)-15-[3-amino(imino)methylaminopropyl]-6-(1-amino-2-phenylethylcarboxamido)-12-benzyl-9-(1H-5-imidazolylmethyl)-18-(1H-3-indolylmethyl)-7,10,13,16,19-pentaoxo-3,4-dithia-8,11,14,17,20-pentaazacycloicosane-1-carboxam | CHEMBL407845
Type:
Small organic molecule
Emp. Form.:
C51H65N15O9S2
Mol. Mass.:
1096.287
SMILES:
C[C@@H](O)[C@H](NC(=O)[C@H]1CSSC[C@H](NC(=O)[C@@H](N)Cc2ccccc2)C(=O)N[C@@H](Cc2cnc[nH]2)C(=O)N[C@H](Cc2ccccc2)C(=O)N[C@@H](CCCNC(N)=N)C(=O)N[C@H](Cc2c[nH]c3ccccc23)C(=O)N1)C(N)=O
: