Target
Sodium channel protein type 4 subunit alpha
Ligand
BDBM50141063
Substrate
Meas. Tech.
ChEMBL_202570 (CHEMBL805351)
Ki
81000±n/a nM
Citation
 Yang, JGharagozloo, PYao, JIlyin, VICarter, RBNguyen, PRobledo, SWoodward, RMHogenkamp, DJ 3-(4-phenoxyphenyl)pyrazoles: a novel class of sodium channel blockers. J Med Chem 47:1547-52 (2004)  
Target
Name:
Sodium channel protein type 4 subunit alpha
Synonyms:
SCN4A SkM1 Sodium channel protein skeletal muscle subunit alpha Sodium channel protein type IV alpha subunit Voltage-gated sodium channel subunit alpha Nav1.4 | Voltage-gated sodium channel subunit alpha Nav1.4 (Nav1.4)
Type:
Protein
Mol. Mass.:
208010.01
Organism:
Homo sapiens (Human)
Description:
P35499
Residue:
1836
  
Inhibitor
Name:
BDBM50141063
Synonyms:
3-(4-Methoxy-phenyl)-1H-pyrazole | CHEMBL39210
Type:
Small organic molecule
Emp. Form.:
C10H10N2O
Mol. Mass.:
174.1992
SMILES:
COc1ccc(cc1)-c1cc[nH]n1
: