Target
Sodium channel protein type 4 subunit alpha
Ligand
BDBM50003659
Substrate
Meas. Tech.
ChEMBL_202570 (CHEMBL805351)
Ki
52000±n/a nM
Citation
 Yang, JGharagozloo, PYao, JIlyin, VICarter, RBNguyen, PRobledo, SWoodward, RMHogenkamp, DJ 3-(4-phenoxyphenyl)pyrazoles: a novel class of sodium channel blockers. J Med Chem 47:1547-52 (2004)  
Target
Name:
Sodium channel protein type 4 subunit alpha
Synonyms:
SCN4A SkM1 Sodium channel protein skeletal muscle subunit alpha Sodium channel protein type IV alpha subunit Voltage-gated sodium channel subunit alpha Nav1.4 | Voltage-gated sodium channel subunit alpha Nav1.4 (Nav1.4)
Type:
Protein
Mol. Mass.:
208010.01
Organism:
Homo sapiens (Human)
Description:
P35499
Residue:
1836
  
Inhibitor
Name:
BDBM50003659
Synonyms:
5H-dibenzo[b,f]azepine-5-carboxamide CARBATROL DIBENZO[B,F]AZEPINE-5-CARBOXYLIC ACID AMIDE(CARBAMAZEPINE) EQUETRO TEGRETOL TERIL US9144538, Carbamazepine
Type:
Small organic molecule
Emp. Form.:
C15H12N2O
Mol. Mass.:
236.2686
SMILES:
NC(=O)N1c2ccccc2C=Cc2ccccc12
: